# Graylog Change logo

**URL:** <https://community.graylog.org/t/graylog-change-logo/2913>\
**Category:** Graylog Central (peer support)\
**Created:** [October 25, 2017, 8:11am UTC](https://community.graylog.org/t/graylog-change-logo/2913 "2017-10-25T08:11:51Z")\
**Posts on this page:** 8\
**Page:** 1

<div class="post-metadata">

**Author:** ![dtdheena](https://sea2.discourse-cdn.com/flex016/user_avatar/community.graylog.org/dtdheena/32/1067_2.png) [@dtdheena](https://community.graylog.org/u/dtdheena)\
**Post date:** [October 25, 2017, 8:11am UTC](https://community.graylog.org/t/graylog-change-logo/2913/1 "2017-10-25T08:11:51Z")

</div>

Facing this error —

[ERROR] Failed to execute goal com.github.eirslett:frontend-maven-plugin:1.4:npm (npm run build) on project graylog2-server: Failed to run task: ‘npm run build’ failed. org.apache.commons.exec.ExecuteException: Process exited with an error: 1 (Exit value: 1) -\> [Help 1]org.apache.maven.lifecycle.LifecycleExecutionException: Failed to execute goal com.github.eirslett:frontend-maven-plugin:1.4:npm (npm run build) on project graylog2-server: Failed to run task

someone help on this

---

<div class="post-metadata">

**Author:** ![jochen](https://sea2.discourse-cdn.com/flex016/user_avatar/community.graylog.org/jochen/32/8_2.png) [@jochen](https://community.graylog.org/u/jochen)\
**Post date:** [October 25, 2017, 8:31am UTC](https://community.graylog.org/t/graylog-change-logo/2913/2 "2017-10-25T08:31:26Z")

</div>

Please post the complete output of the build process and elaborate on your setup (version of Java, version of Maven, operating system used to build Graylog).

---

<div class="post-metadata">

**Author:** ![dtdheena](https://sea2.discourse-cdn.com/flex016/user_avatar/community.graylog.org/dtdheena/32/1067_2.png) [@dtdheena](https://community.graylog.org/u/dtdheena)\
**Post date:** [October 25, 2017, 8:46am UTC](https://community.graylog.org/t/graylog-change-logo/2913/3 "2017-10-25T08:46:26Z")

</div>

Used for build:

Os - Ubuntu Desktop 16.04

openjdk version "1.8.0\_131"  
OpenJDK Runtime Environment (build 1.8.0\_131-8u131-b11-2ubuntu1.16.04.3-b11)  
OpenJDK 64-Bit Server VM (build 25.131-b11, mixed mode)

Apache Maven 3.3.9  
Maven home: /usr/share/maven  
Java version: 1.8.0\_131, vendor: Oracle Corporation

Facing This error at end of the build after change the logo file graylog2-server/graylog2-web-interface/public/images/toplogo.png:

* * *

[INFO] Reactor Summary:  
[INFO]  
[INFO] Graylog Parent POM … SUCCESS [1.430 s]  
[INFO] Graylog Project Parent POM … SUCCESS [2.017 s]  
[INFO] AutoValue JavaBean extension … SUCCESS [5.809 s]  
[INFO] Graylog … FAILURE [03:33 min]  
[INFO] integration-tests … SKIPPED  
[INFO] Graylog Plugin Parent POM … SKIPPED  
[INFO] Graylog Plugin with Web support Parent POM … SKIPPED  
[INFO] graylog-plugin-archetype … SKIPPED  
[INFO] ------------------------------------------------------------------------  
[INFO] BUILD FAILURE  
[INFO] ------------------------------------------------------------------------  
[INFO] Total time: 03:44 min  
[INFO] Finished at: 2017-10-25T14:13:42+05:30  
[INFO] Final Memory: 39M/230M  
[INFO] ------------------------------------------------------------------------  
[ERROR] Failed to execute goal com.github.eirslett:frontend-maven-plugin:1.4:npm (npm run build) on project graylog2-server: Failed to run task: ‘npm run build’ failed. org.apache.commons.exec.ExecuteException: Process exited with an error: 1 (Exit value: 1) -\> [Help 1]  
[ERROR]  
[ERROR] To see the full stack trace of the errors, re-run Maven with the -e switch.  
[ERROR] Re-run Maven using the -X switch to enable full debug logging.  
[ERROR]  
[ERROR] For more information about the errors and possible solutions, please read the following articles:  
[ERROR] [Help 1] [http://cwiki.apache.org/confluence/display/MAVEN/MojoFailureException](http://cwiki.apache.org/confluence/display/MAVEN/MojoFailureException)  
[ERROR]  
[ERROR] After correcting the problems, you can resume the build with the command  
[ERROR] mvn -rf :graylog2-server

* * *

---

<div class="post-metadata">

**Author:** ![jochen](https://sea2.discourse-cdn.com/flex016/user_avatar/community.graylog.org/jochen/32/8_2.png) [@jochen](https://community.graylog.org/u/jochen)\
**Post date:** [October 25, 2017, 9:01am UTC](https://community.graylog.org/t/graylog-change-logo/2913/4 "2017-10-25T09:01:56Z")

</div>

That’s still not the complete build output (including the exact command you have executed to start the build).

---

<div class="post-metadata">

**Author:** ![dtdheena](https://sea2.discourse-cdn.com/flex016/user_avatar/community.graylog.org/dtdheena/32/1067_2.png) [@dtdheena](https://community.graylog.org/u/dtdheena)\
**Post date:** [October 25, 2017, 9:16am UTC](https://community.graylog.org/t/graylog-change-logo/2913/5 "2017-10-25T09:16:33Z")

</div>

@jochen please verify the [error log](https://goo.gl/UwWzte) that i am attached here.

---

<div class="post-metadata">

**Author:** ![jochen](https://sea2.discourse-cdn.com/flex016/user_avatar/community.graylog.org/jochen/32/8_2.png) [@jochen](https://community.graylog.org/u/jochen)\
**Post date:** [October 25, 2017, 9:31am UTC](https://community.graylog.org/t/graylog-change-logo/2913/6 "2017-10-25T09:31:32Z")

</div>

Try running the build as another user, i. e. clone the repository as a normal user and run the build _not_ as “root”.

Details:

> [@Request help for the contribution documentation](https://community.graylog.org/t/request-help-for-the-contribution-documentation/898/13):
>
> Hey Stephen, the reason is that your build runs as root. npm refuses to perform script tasks when run as root, which is necessary for the graylog-web-plugin module to be transpiled properly. Please run your build as a non-privileged user. Kind regards, D.

---

<div class="post-metadata">

**Author:** ![dtdheena](https://sea2.discourse-cdn.com/flex016/user_avatar/community.graylog.org/dtdheena/32/1067_2.png) [@dtdheena](https://community.graylog.org/u/dtdheena)\
**Post date:** [October 25, 2017, 12:03pm UTC](https://community.graylog.org/t/graylog-change-logo/2913/7 "2017-10-25T12:03:40Z")

</div>

@jochen such a great guidance thank you so much. it’s works perfectly without any problem.

---

<div class="post-metadata">

**Author:** ![system](https://us1.discourse-cdn.com/flex016/uploads/graylog/original/3X/c/7/c7c09c6b5099570133d6502b83f50ba4430de5b6.png) [@system](https://community.graylog.org/u/system)\
**Post date:** [November 8, 2017, 12:03pm UTC](https://community.graylog.org/t/graylog-change-logo/2913/8 "2017-11-08T12:03:48Z")

</div>

This topic was automatically closed 14 days after the last reply. New replies are no longer allowed.
